BDBM50092163 CHEMBL3582457
SMILES C1CC1n1c(nc2ccccc12)-c1cccnc1
InChI Key InChIKey=HQGNIQRKGYWIAD-UHFFFAOYSA-N
Data  2 IC50
  Tab Delimited (TSV)   2D SDfile   Computed 3D by Vconf -m prep SDfile
Find this compound or compounds like it in BindingDB:
Activity Spreadsheet -- Enzyme Inhibition Constant Data from BindingDB
Found 2 hits for monomerid = 50092163
TargetCytochrome P450 11B2, mitochondrial(Homo sapiens (Human))
Merck Research Laboratories
Curated by ChEMBL
LigandPNGBDBM50092163(CHEMBL3582457)
Affinity DataIC50:  49nM. Assay description: Inhibition of human CYP11B2 expressed in V79 cells incubated for 1 hr before 11-deoxycorticosterone substrate addition by HTRF-based assay
In DepthDetails ArticlePubMed
TargetCytochrome P450 11B1, mitochondrial(Homo sapiens (Human))
Merck Research Laboratories
Curated by ChEMBL
LigandPNGBDBM50092163(CHEMBL3582457)
Affinity DataIC50: >8.33E+3nM. Assay description: Inhibition of human CYP11B1 expressed in V79 cells incubated for 1 hr before 11-deoxycortisol substrate addition by HTRF-based assay
In DepthDetails ArticlePubMed