BDBM50092268 5-(4-nitrobenzylidene)-2-thioxothiazolidin-4-one::5-[1-(4-Nitro-phenyl)-meth-(Z)-ylidene]-2-thioxo-thiazolidin-4-one::CHEMBL66064
SMILES [O-][N+](=O)c1ccc(C=C2SC(S)=NC2=O)cc1
InChI Key InChIKey=FRWNAQDBODEVAL-UHFFFAOYSA-N
Data  3 IC50
  Tab Delimited (TSV)   2D SDfile   Computed 3D by Vconf -m prep SDfile
Find this compound or compounds like it in BindingDB:
Activity Spreadsheet -- Enzyme Inhibition Constant Data from BindingDB
Found 3 hits for monomerid = 50092268
TargetRNA-directed RNA polymerase(Hepatitis C virus)
Amgen
Curated by ChEMBL
LigandPNGBDBM50092268(5-(4-nitrobenzylidene)-2-thioxothiazolidin-4-one |...)
Affinity DataIC50:  2.20E+4nM. Assay description: Inhibitory activity against HCV delta 21 NS5b RNA polymerase
In DepthDetails ArticlePubMed
TargetBeta-lactamase(Enterobacter cloacae)
The R. W. Johnson Pharmaceutical Research Institute
Curated by ChEMBL
LigandPNGBDBM50092268(5-(4-nitrobenzylidene)-2-thioxothiazolidin-4-one |...)
Affinity DataIC50: >7.00E+5nM. Assay description: Inhibitory activity against class A Beta-lactamase TEM isolated from Enterobacter coli
In DepthDetails ArticlePubMed
TargetBeta-lactamase(Enterobacter cloacae)
The R. W. Johnson Pharmaceutical Research Institute
Curated by ChEMBL
LigandPNGBDBM50092268(5-(4-nitrobenzylidene)-2-thioxothiazolidin-4-one |...)
Affinity DataIC50:  4.30E+4nM. Assay description: Inhibitory activity against class C Beta-lactamase isolated from Enterobacter cloacae
In DepthDetails ArticlePubMed