BDBM50093066 ((S)-4-Cyclohexyl-3-{2-[((R)-5-guanidino-2-phenylmethanesulfonylamino-pentanoyl)-methyl-amino]-acetylamino}-2-oxo-butyrylamino)-acetic acid ethyl ester::CHEMBL306309
SMILES CCOC(=O)CNC(=O)C(=O)[C@H](CC1CCCCC1)NC(=O)CN(C)C(=O)[C@@H](CCCNC(N)=N)NS(=O)(=O)Cc1ccccc1
InChI Key InChIKey=FQIQOFWMYZLIQG-RPWUZVMVSA-N
Data  2 IC50
  Tab Delimited (TSV)   2D SDfile   Computed 3D by Vconf -m prep SDfile
Find this compound or compounds like it in BindingDB:
Activity Spreadsheet -- Enzyme Inhibition Constant Data from BindingDB
Found 2 hits for monomerid = 50093066
TargetCoagulation factor X(Homo sapiens (Human))
Corvas International
Curated by ChEMBL
LigandPNGBDBM50093066(((S)-4-Cyclohexyl-3-{2-[((R)-5-guanidino-2-phenylm...)
Affinity DataIC50:  2.10nM. Assay description: Inhibitory activity against Coagulation factor X
In DepthDetails ArticlePubMed
TargetProthrombin(Homo sapiens (Human))
Corvas International
Curated by ChEMBL
LigandPNGBDBM50093066(((S)-4-Cyclohexyl-3-{2-[((R)-5-guanidino-2-phenylm...)
Affinity DataIC50: >2.50E+3nM. Assay description: Compound was evaluated in vitro for its inhibitory activity against Thrombin (FIIa)
In DepthDetails ArticlePubMed