BDBM50093282 CHEMBL130203::N-[2-(8-Methoxy-acenaphthen-1-yl)-ethyl]-acetamide
SMILES COc1ccc2cccc3CC(CCNC(C)=O)c1c23
InChI Key InChIKey=WGZSPGSXLCATST-UHFFFAOYSA-N
Data  2 KI
  Tab Delimited (TSV)   2D SDfile   Computed 3D by Vconf -m prep SDfile
Find this compound or compounds like it in BindingDB:
Activity Spreadsheet -- Enzyme Inhibition Constant Data from BindingDB
Found 2 hits for monomerid = 50093282
TargetMelatonin receptor type 1A(Homo sapiens (Human))
Paris-Sud University
Curated by ChEMBL
LigandPNGBDBM50093282(CHEMBL130203 | N-[2-(8-Methoxy-acenaphthen-1-yl)-e...)
Affinity DataKi:  0.410nM. Assay description: Binding affinity for human melatonin receptor type 1A, expressed in HEK-293 cells (2-[125I]-Iodomelatonin is used as radioligand)
In DepthDetails ArticlePubMed
TargetMelatonin receptor type 1B(Homo sapiens (Human))
Paris-Sud University
Curated by ChEMBL
LigandPNGBDBM50093282(CHEMBL130203 | N-[2-(8-Methoxy-acenaphthen-1-yl)-e...)
Affinity DataKi:  0.590nM. Assay description: Binding affinity for melatonin receptor type 1B, expressed in HEK-293 cells (2-[125I]-Iodomelatonin is used as radioligand)
In DepthDetails ArticlePubMed