BDBM50095384 5-(3-Bromo-phenyl)-7-(4-dimethylamino-phenyl)-pyrido[2,3-d]pyrimidin-4-ylamine::CHEMBL68749
SMILES CN(C)c1ccc(cc1)-c1cc(-c2cccc(Br)c2)c2c(N)ncnc2n1
InChI Key InChIKey=JBIQVVFBLQWGPR-UHFFFAOYSA-N
Data  4 IC50
  Tab Delimited (TSV)   2D SDfile   Computed 3D by Vconf -m prep SDfile
Find this compound or compounds like it in BindingDB:
Activity Spreadsheet -- Enzyme Inhibition Constant Data from BindingDB
Found 4 hits for monomerid = 50095384
TargetAdenosine kinase(Rattus norvegicus (rat))
Abbott Laboratories
Curated by ChEMBL
LigandPNGBDBM50095384(5-(3-Bromo-phenyl)-7-(4-dimethylamino-phenyl)-pyri...)
Affinity DataIC50:  5nM. Assay description: Inhibitory activity against cytosolic adenosine kinase by ADO phosphorylation assay
In DepthDetails ArticlePubMed
TargetAdenosine kinase(Rattus norvegicus (rat))
Abbott Laboratories
Curated by ChEMBL
LigandPNGBDBM50095384(5-(3-Bromo-phenyl)-7-(4-dimethylamino-phenyl)-pyri...)
Affinity DataIC50:  5nM. Assay description: Inhibitory activity against intact cell adenosine kinase by ADO phosphorylation assay
In DepthDetails ArticlePubMed
TargetAdenosine kinase(Homo sapiens (Human))
Abbott Laboratories
Curated by ChEMBL
LigandPNGBDBM50095384(5-(3-Bromo-phenyl)-7-(4-dimethylamino-phenyl)-pyri...)
Affinity DataIC50:  167nM. Assay description: Inhibition of adenosine phosphorylation in confluent IMR-32 (human neuroblastoma) cells.
In DepthDetails ArticlePubMed
TargetAdenosine kinase(Rattus norvegicus (rat))
Abbott Laboratories
Curated by ChEMBL
LigandPNGBDBM50095384(5-(3-Bromo-phenyl)-7-(4-dimethylamino-phenyl)-pyri...)
Affinity DataIC50:  5nM. Assay description: In vitro inhibition of Adenosine kinase (AK)
In DepthDetails ArticlePubMed