BDBM50095464 CHEMBL3590437::US9649308, Example 39
SMILES Cn1cc(NC(=O)c2cnn3ccc(OCCN)nc23)c(n1)C(N)=O
InChI Key InChIKey=LFHYJMQWVVSUKB-UHFFFAOYSA-N
Data  2 IC50
  Tab Delimited (TSV)   2D SDfile   Computed 3D by Vconf -m prep SDfile
Find this compound or compounds like it in BindingDB:
Activity Spreadsheet -- Enzyme Inhibition Constant Data from BindingDB
Found 2 hits for monomerid = 50095464
TargetInterleukin-1 receptor-associated kinase 4(Homo sapiens (Human))
Merck Sharp & Dohme
US Patent
LigandPNGBDBM50095464(CHEMBL3590437 | US9649308, Example 39)
Affinity DataIC50:  9.20E+3nM. Assay description: The kinase activity of IRAK4 is determined by its ability to catalyze the phosphorylation of a fluorescent polypeptide substrate. The extent of phosp...
In DepthDetails US Patent
TargetInterleukin-1 receptor-associated kinase 4(Homo sapiens (Human))
Merck Sharp & Dohme
US Patent
LigandPNGBDBM50095464(CHEMBL3590437 | US9649308, Example 39)
Affinity DataIC50:  9.20E+3nM. Assay description: Inhibition of human IRAK4 assessed as phosphorylation of fluorescent peptide substrate after 30 mins by fluorescent polarization reader
In DepthDetails ArticlePubMed