BDBM50096315 CHEMBL3586725
SMILES Cc1cc2c(cnc(NC3CCNCC3)c2[nH]c1=O)-c1ccncc1
InChI Key InChIKey=RRJGXBWWZBPSAH-ACCUITESSA-N
Data  2 IC50
  Tab Delimited (TSV)   2D SDfile   Computed 3D by Vconf -m prep SDfile
Find this compound or compounds like it in BindingDB:
Activity Spreadsheet -- Enzyme Inhibition Constant Data from BindingDB
Found 2 hits for monomerid = 50096315
TargetATPase family AAA domain-containing protein 2(Homo sapiens (Human))
Glaxosmithkline
Curated by ChEMBL
LigandPNGBDBM50096315(CHEMBL3586725)
Affinity DataIC50:  2.00E+4nM. Assay description: Displacement of histone H4 peptide from FLAG-6His-Tev-ATAD2 (981 to 1121) (unknown origin) expressed in Escherichia coli BL21 (DE3) after 30 mins by ...
In DepthDetails ArticlePubMed
TargetBromodomain-containing protein 4(Homo sapiens (Human))
Glaxosmithkline
Curated by ChEMBL
LigandPNGBDBM50096315(CHEMBL3586725)
Affinity DataIC50:  3.16E+3nM. Assay description: Displacement of I-BET762 from 6His-Thr-BRD4 (1 to 477) BD1 (unknown origin) harboring BD2 Y390A mutant after 30 mins by TR-FRET analysis
In DepthDetails ArticlePubMed