BDBM50096726 4-[3-Carboxy-2-(3-carboxy-propionylamino)-propionylamino]-4-[1-(2,2-dimethyl-1-{3-methyl-1-[3,3,3-trifluoro-1-(1-naphthalen-2-yl-ethylaminooxalyl)-propylcarbamoyl]-butylcarbamoyl}-propylcarbamoyl)-2-o-tolyl-ethylcarbamoyl]-butyric acid::CHEMBL427986
SMILES CC(C)C[C@H](NC(=O)[C@@H](NC(=O)[C@H](Cc1ccccc1C)NC(=O)[C@H](CCC(O)=O)NC(=O)[C@H](CC(O)=O)NC(=O)CCC(O)=O)C(C)(C)C)C(=O)N[C@H](CC(F)(F)F)C(=O)C(=O)N[C@@H](C)c1ccc2ccccc2c1
InChI Key InChIKey=HOTYIQRBUUORJU-MGDWCJICSA-N
Data  1 IC50
  Tab Delimited (TSV)   2D SDfile   Computed 3D by Vconf -m prep SDfile
Find this compound or compounds like it in BindingDB:
Activity Spreadsheet -- Enzyme Inhibition Constant Data from BindingDB
Found 1 hit for monomerid = 50096726
TargetGenome polyprotein/Non-structural protein 4A(Hepatitis C virus)
Roche Discover Welwyn
Curated by ChEMBL
LigandPNGBDBM50096726(4-[3-Carboxy-2-(3-carboxy-propionylamino)-propiony...)
Affinity DataIC50:  4nM. Assay description: Binding affinity towards 5-hydroxytryptamine 3 receptor
In DepthDetails ArticlePubMed