BDBM50096874 CHEMBL3580775
SMILES [H][C@@]1(CCc2cc(F)c(F)cc12)[C@@H](N)CC(=O)N1CCn2c(C1)nnc2C(F)(F)F
InChI Key InChIKey=XTAFGJNJWKVLFD-HZMBPMFUSA-N
Data  4 IC50
  Tab Delimited (TSV)   2D SDfile   Computed 3D by Vconf -m prep SDfile
Find this compound or compounds like it in BindingDB:
Activity Spreadsheet -- Enzyme Inhibition Constant Data from BindingDB
Found 4 hits for monomerid = 50096874
TargetDipeptidyl peptidase 4(Homo sapiens (Human))
Chinese Academy Of Sciences
Curated by ChEMBL
LigandPNGBDBM50096874(CHEMBL3580775)
Affinity DataIC50:  11nM. Assay description: Inhibition of DPP4 extracted from human Caco2 cells using H-Gly-Pro-AMC substrate after 10 mins by fluorescence assay
In DepthDetails ArticlePubMed
TargetPotassium voltage-gated channel subfamily H member 2(Homo sapiens (Human))
Chinese Academy Of Sciences
Curated by ChEMBL
LigandPNGBDBM50096874(CHEMBL3580775)
Affinity DataIC50: >2.00E+4nM. Assay description: Inhibition of human ERG channel
In DepthDetails ArticlePubMed
TargetDipeptidyl peptidase 9(Homo sapiens (Human))
Chinese Academy Of Sciences
Curated by ChEMBL
LigandPNGBDBM50096874(CHEMBL3580775)
Affinity DataIC50: >1.00E+4nM. Assay description: Inhibition of human recombinant DPP9 using H-Gly-Pro-AMC substrate after 10 mins by fluorescence assay
In DepthDetails ArticlePubMed
TargetDipeptidyl peptidase 8(Homo sapiens (Human))
Chinese Academy Of Sciences
Curated by ChEMBL
LigandPNGBDBM50096874(CHEMBL3580775)
Affinity DataIC50: >1.00E+4nM. Assay description: Inhibition of human recombinant DPP8 using H-Gly-Pro-AMC substrate after 10 mins by fluorescence assay
In DepthDetails ArticlePubMed