BDBM50097930 CHEMBL82860::Sulfamic acid 4-heptanoyl-phenyl ester
SMILES CCCCCCC(=O)c1ccc(OS(N)(=O)=O)cc1
InChI Key InChIKey=UNLHPJJZQQDTRV-UHFFFAOYSA-N
Data  3 IC50
  Tab Delimited (TSV)   2D SDfile   Computed 3D by Vconf -m prep SDfile
Find this compound or compounds like it in BindingDB:
Activity Spreadsheet -- Enzyme Inhibition Constant Data from BindingDB
Found 3 hits for monomerid = 50097930
TargetSteryl-sulfatase(Homo sapiens (Human))
Punjabi University
Curated by ChEMBL
LigandPNGBDBM50097930(CHEMBL82860 | Sulfamic acid 4-heptanoyl-phenyl est...)
Affinity DataIC50:  3.40E+3nM. Assay description: Inhibition of placental microsomal estrone sulfatase (unknown origin) using [3H]-estrone sulphate as substrate incubated for 20 mins by scintillation...
In DepthDetails ArticlePubMed
TargetSteryl-sulfatase(Homo sapiens (Human))
Punjabi University
Curated by ChEMBL
LigandPNGBDBM50097930(CHEMBL82860 | Sulfamic acid 4-heptanoyl-phenyl est...)
Affinity DataIC50:  5.00E+3nM. Assay description: Inhibition of Estrone sulfatase
In DepthDetails ArticlePubMed
TargetSteryl-sulfatase(Homo sapiens (Human))
Punjabi University
Curated by ChEMBL
LigandPNGBDBM50097930(CHEMBL82860 | Sulfamic acid 4-heptanoyl-phenyl est...)
Affinity DataIC50:  5.00E+3nM. Assay description: Inhibition of estrone sulfatase (ES)
In DepthDetails ArticlePubMed