BDBM50098143 5-Methylsulfanyl-4-[2-(3-phenyl-propylamino)-thiazol-4-yl]-thiophene-2-carboxamidine::CHEMBL355531
SMILES CSc1sc(cc1-c1csc(NCCCc2ccccc2)n1)C(N)=N
InChI Key InChIKey=WWYYVQSACHTSIU-UHFFFAOYSA-N
Data  1 KI
  Tab Delimited (TSV)   2D SDfile   Computed 3D by Vconf -m prep SDfile
Find this compound or compounds like it in BindingDB:
Activity Spreadsheet -- Enzyme Inhibition Constant Data from BindingDB
Found 1 hit for monomerid = 50098143
TargetUrokinase-type plasminogen activator(Homo sapiens (Human))
3-Dimensional Pharmaceuticals
Curated by ChEMBL
LigandPNGBDBM50098143(5-Methylsulfanyl-4-[2-(3-phenyl-propylamino)-thiaz...)
Affinity DataKi:  350nM. Assay description: In vitro inhibitory activity against Urokinase-type plasminogen activator (microPa)
In DepthDetails ArticlePubMed