BDBM50098155 4-[2-(4-Methyl-benzylamino)-thiazol-4-yl]-5-methylsulfanyl-thiophene-2-carboxamidine::CHEMBL173392
SMILES CSc1sc(cc1-c1csc(NCc2ccc(C)cc2)n1)C(N)=N
InChI Key InChIKey=YODCXSDDGBHEEN-UHFFFAOYSA-N
Data  1 KI
  Tab Delimited (TSV)   2D SDfile   Computed 3D by Vconf -m prep SDfile
Find this compound or compounds like it in BindingDB:
Activity Spreadsheet -- Enzyme Inhibition Constant Data from BindingDB
Found 1 hit for monomerid = 50098155
TargetUrokinase-type plasminogen activator(Homo sapiens (Human))
3-Dimensional Pharmaceuticals
Curated by ChEMBL
LigandPNGBDBM50098155(4-[2-(4-Methyl-benzylamino)-thiazol-4-yl]-5-methyl...)
Affinity DataKi:  640nM. Assay description: In vitro inhibitory activity against Urokinase-type plasminogen activator (microPa)
In DepthDetails ArticlePubMed