BDBM50098156 5-Methylsulfanyl-4-[2-(naphthalen-1-ylamino)-thiazol-4-yl]-thiophene-2-carboxamidine::CHEMBL170410
SMILES CSc1sc(cc1-c1csc(Nc2cccc3ccccc23)n1)C(N)=N
InChI Key InChIKey=SBGBNTFKXMZPSQ-UHFFFAOYSA-N
Data  1 KI
  Tab Delimited (TSV)   2D SDfile   Computed 3D by Vconf -m prep SDfile
Find this compound or compounds like it in BindingDB:
Activity Spreadsheet -- Enzyme Inhibition Constant Data from BindingDB
Found 1 hit for monomerid = 50098156
TargetUrokinase-type plasminogen activator(Homo sapiens (Human))
3-Dimensional Pharmaceuticals
Curated by ChEMBL
LigandPNGBDBM50098156(5-Methylsulfanyl-4-[2-(naphthalen-1-ylamino)-thiaz...)
Affinity DataKi:  500nM. Assay description: In vitro inhibitory activity against Urokinase-type plasminogen activator (microPa)
In DepthDetails ArticlePubMed