BDBM50098237 2-{4-[2-(Cyclopentyl-methyl-carbamoyl)-2-(naphthalene-2-sulfonylamino)-ethyl]-phenyl}-ethyl-ammonium
SMILES CN(C1CCCC1)C(=O)[C@H](Cc1ccc(CC[NH3+])cc1)NS(=O)(=O)c1ccc2ccccc2c1
InChI Key InChIKey=ONZJLWKBZFXGMH-SANMLTNESA-O
Data  1 KI
  Tab Delimited (TSV)   2D SDfile   Computed 3D by Vconf -m prep SDfile
Find this compound or compounds like it in BindingDB:
Activity Spreadsheet -- Enzyme Inhibition Constant Data from BindingDB
Found 1 hit for monomerid = 50098237
TargetProthrombin(Homo sapiens (Human))
Yale University
Curated by ChEMBL
LigandPNGBDBM50098237(2-{4-[2-(Cyclopentyl-methyl-carbamoyl)-2-(naphthal...)
Affinity DataKi:  3.30nM. Assay description: Binding affinity was determined against human thrombin
In DepthDetails ArticlePubMed