BDBM500984 7-((5-((3S.4S)- 4-fluoro-3- liydroxy-piperidin-1- yl)pyridin-2- yl)amino)-4- (8-fluoroimidazo [1,2-a]pyridin- 3-yl)-2,3- dihydro-1H- pyrrolo[3,4- c]pyridin-1-one::US11021481, Compound I-653::US11078201, Compound I-653::US11548890, Compound I-653
SMILES O[C@H]1CN(CC[C@@H]1F)c1ccc(Nc2cnc(c3CNC(=O)c23)-c2cnc3c(F)cccn23)nc1
InChI Key InChIKey=ACEGWIGSESPSNT-KXBFYZLASA-N
Data  5 IC50
  Tab Delimited (TSV)   2D SDfile   Computed 3D by Vconf -m prep SDfile
Find this compound or compounds like it in BindingDB:
Activity Spreadsheet -- Enzyme Inhibition Constant Data from BindingDB
Found 5 hits for monomerid = 500984
TargetMitogen-activated protein kinase kinase kinase kinase 1(Homo sapiens (Human))
Nimbus Saturn
US Patent
LigandPNGBDBM500984(7-((5-((3S.4S)- 4-fluoro-3- liydroxy-piperidin-1- ...)
Affinity DataIC50: <100nM. Assay description: HPK1 biochemical enzyme assay: HPK1 enzyme inhibition was measured using a microfluidic mobility shift assay. Reactions were performed in a 384-well ...
Ligand InfoPC cidPC sid
In DepthDetails US Patent
TargetMitogen-activated protein kinase kinase kinase kinase 1(Homo sapiens (Human))
Nimbus Saturn
US Patent
LigandPNGBDBM500984(7-((5-((3S.4S)- 4-fluoro-3- liydroxy-piperidin-1- ...)
Affinity DataIC50: <100nM. Assay description: HPK1 biochemical enzyme assay: HPK1 enzyme inhibition was measured using a microfluidic mobility shift assay. Reactions were performed in a 384-well ...
Ligand InfoPC cidPC sid
In DepthDetails US Patent
TargetMitogen-activated protein kinase kinase kinase kinase 1(Homo sapiens (Human))
Nimbus Saturn
US Patent
LigandPNGBDBM500984(7-((5-((3S.4S)- 4-fluoro-3- liydroxy-piperidin-1- ...)
Affinity DataIC50: <100nM. Assay description: HPK1 biochemical enzyme assay: HPK1 enzyme inhibition was measured using a microfluidic mobility shift assay. Reactions were performed in a 384-well ...
Ligand InfoPC cidPC sid
In DepthDetails US Patent
TargetMitogen-activated protein kinase kinase kinase kinase 1(Homo sapiens (Human))
Nimbus Saturn
US Patent
LigandPNGBDBM500984(7-((5-((3S.4S)- 4-fluoro-3- liydroxy-piperidin-1- ...)
Affinity DataIC50: <100nM. Assay description: HPK1 biochemical enzyme assay: HPK1 enzyme inhibition was measured using a microfluidic mobility shift assay. Reactions were performed in a 384-well ...
Ligand InfoPC cidPC sid
In DepthDetails US Patent
TargetMitogen-activated protein kinase kinase kinase kinase 1(Homo sapiens (Human))
Nimbus Saturn
US Patent
LigandPNGBDBM500984(7-((5-((3S.4S)- 4-fluoro-3- liydroxy-piperidin-1- ...)
Affinity DataIC50: <100nM. Assay description: HPK1 biochemical enzyme assay: HPK1 enzyme inhibition was measured using a microfluidic mobility shift assay. Reactions were performed in a 384-well ...
Ligand InfoPC cidPC sid
In DepthDetails US Patent