BDBM50098455 4-[(1-Cyclopropylmethyl-3-methyl-piperidin-4-yl)-(3-methoxy-phenyl)-amino]-N,N-diethyl-benzamide::CHEMBL174569
SMILES CCN(CC)C(=O)c1ccc(cc1)N([C@@H]1CCN(CC2CC2)C[C@@H]1C)c1cccc(OC)c1
InChI Key InChIKey=KEHOXWIRLSRNHN-KDYSTLNUSA-N
Data  3 KI
  Tab Delimited (TSV)   2D SDfile   Computed 3D by Vconf -m prep SDfile
Find this compound or compounds like it in BindingDB:
Activity Spreadsheet -- Enzyme Inhibition Constant Data from BindingDB
Found 3 hits for monomerid = 50098455
TargetDelta-type opioid receptor(Rattus norvegicus (rat))
Research Triangle Institute
Curated by ChEMBL
LigandPNGBDBM50098455(4-[(1-Cyclopropylmethyl-3-methyl-piperidin-4-yl)-(...)
Affinity DataKi:  36nM. Assay description: Affinity of [H]DADLE to the delta opioid receptor from rat brain
In DepthDetails ArticlePubMed
TargetMu-type opioid receptor(Rattus norvegicus (rat))
Research Triangle Institute
Curated by ChEMBL
LigandPNGBDBM50098455(4-[(1-Cyclopropylmethyl-3-methyl-piperidin-4-yl)-(...)
Affinity DataKi: >6.54E+3nM. Assay description: Affinity of [3H]DAMGO to the mu opioid receptor from rat brain
In DepthDetails ArticlePubMed
TargetKappa-type opioid receptor(Rattus norvegicus (rat))
Research Triangle Institute
Curated by ChEMBL
LigandPNGBDBM50098455(4-[(1-Cyclopropylmethyl-3-methyl-piperidin-4-yl)-(...)
Affinity DataKi: >7.46E+3nM. Assay description: Affinity of [3H]U-69593 to opioid receptor kappa 1 from rat brain
In DepthDetails ArticlePubMed