BDBM500985 4-(7- fluoroimidazo [1,2-a]pyridin- 3-yl)-7-((5-(3- hydroxy-3- (morpholinom ethyl)piperidin- 1-yl)pyridin- 2-yl)amino)- 2.3-dihydro- 1H-pyrrolo[3,4- c]pyridin-1-one::US11021481, Compound I-654::US11078201, Compound I-654::US11548890, Compound I-654
SMILES OC1(CN2CCOCC2)CCCN(C1)c1ccc(Nc2cnc(c3CNC(=O)c23)-c2cnc3cc(F)ccn23)nc1
InChI Key InChIKey=VTLSIXIOWRBYIY-UHFFFAOYSA-N
Data  5 IC50
  Tab Delimited (TSV)   2D SDfile   Computed 3D by Vconf -m prep SDfile
Find this compound or compounds like it in BindingDB:
Activity Spreadsheet -- Enzyme Inhibition Constant Data from BindingDB
Found 5 hits for monomerid = 500985
TargetMitogen-activated protein kinase kinase kinase kinase 1(Homo sapiens (Human))
Nimbus Saturn
US Patent
LigandPNGBDBM500985(4-(7- fluoroimidazo [1,2-a]pyridin- 3-yl)-7-((5-(3...)
Affinity DataIC50: <100nM. Assay description: HPK1 biochemical enzyme assay: HPK1 enzyme inhibition was measured using a microfluidic mobility shift assay. Reactions were performed in a 384-well ...
Ligand InfoPC cidPC sid
In DepthDetails US Patent
TargetMitogen-activated protein kinase kinase kinase kinase 1(Homo sapiens (Human))
Nimbus Saturn
US Patent
LigandPNGBDBM500985(4-(7- fluoroimidazo [1,2-a]pyridin- 3-yl)-7-((5-(3...)
Affinity DataIC50: <100nM. Assay description: HPK1 biochemical enzyme assay: HPK1 enzyme inhibition was measured using a microfluidic mobility shift assay. Reactions were performed in a 384-well ...
Ligand InfoPC cidPC sid
In DepthDetails US Patent
TargetMitogen-activated protein kinase kinase kinase kinase 1(Homo sapiens (Human))
Nimbus Saturn
US Patent
LigandPNGBDBM500985(4-(7- fluoroimidazo [1,2-a]pyridin- 3-yl)-7-((5-(3...)
Affinity DataIC50: <100nM. Assay description: HPK1 biochemical enzyme assay: HPK1 enzyme inhibition was measured using a microfluidic mobility shift assay. Reactions were performed in a 384-well ...
Ligand InfoPC cidPC sid
In DepthDetails US Patent
TargetMitogen-activated protein kinase kinase kinase kinase 1(Homo sapiens (Human))
Nimbus Saturn
US Patent
LigandPNGBDBM500985(4-(7- fluoroimidazo [1,2-a]pyridin- 3-yl)-7-((5-(3...)
Affinity DataIC50: <100nM. Assay description: HPK1 biochemical enzyme assay: HPK1 enzyme inhibition was measured using a microfluidic mobility shift assay. Reactions were performed in a 384-well ...
Ligand InfoPC cidPC sid
In DepthDetails US Patent
TargetMitogen-activated protein kinase kinase kinase kinase 1(Homo sapiens (Human))
Nimbus Saturn
US Patent
LigandPNGBDBM500985(4-(7- fluoroimidazo [1,2-a]pyridin- 3-yl)-7-((5-(3...)
Affinity DataIC50: <100nM. Assay description: HPK1 biochemical enzyme assay: HPK1 enzyme inhibition was measured using a microfluidic mobility shift assay. Reactions were performed in a 384-well ...
Ligand InfoPC cidPC sid
In DepthDetails US Patent