BDBM50098525 2-(8-Bromo-benzo[1,2-b;4,5-b']difuran-4-yl)-1-methyl-ethyl-ammonium; chloride::CHEMBL6706
SMILES C[C@@H]([NH3+])Cc1c2ccoc2c(Br)c2ccoc12
InChI Key InChIKey=GIKPTWKWYXCBEC-SSDOTTSWSA-O
Data  2 KI  1 EC50
  Tab Delimited (TSV)   2D SDfile   Computed 3D by Vconf -m prep SDfile
Find this compound or compounds like it in BindingDB:
Activity Spreadsheet -- Enzyme Inhibition Constant Data from BindingDB
Found 3 hits for monomerid = 50098525
Target5-hydroxytryptamine receptor 2C(Rattus norvegicus (Rat))
Purdue University
Curated by ChEMBL
LigandPNGBDBM50098525(2-(8-Bromo-benzo[1,2-b;4,5-b']difuran-4-yl)-1-meth...)
Affinity DataKi:  0.110nM. Assay description: Binding affinity at cloned rat 5-hydroxytryptamine 2C receptor using [3H]-DOI as radioligand
In DepthDetails ArticlePubMed
Target5-hydroxytryptamine receptor 2A(Rattus norvegicus (rat))
Purdue University
Curated by ChEMBL
LigandPNGBDBM50098525(2-(8-Bromo-benzo[1,2-b;4,5-b']difuran-4-yl)-1-meth...)
Affinity DataKi:  0.310nM. Assay description: Binding affinity at cloned rat 5-hydroxytryptamine 2A receptor using [3H]-DOB as radioligand
In DepthDetails ArticlePubMed
Target5-hydroxytryptamine receptor 2A(Rattus norvegicus (rat))
Purdue University
Curated by ChEMBL
LigandPNGBDBM50098525(2-(8-Bromo-benzo[1,2-b;4,5-b']difuran-4-yl)-1-meth...)
Affinity DataEC50:  2.70nM. Assay description: Ability to stimulate phosphoinositide hydrolysis in NIH3T3 cells expressing the 5-hydroxytryptamine 2A receptor
In DepthDetails ArticlePubMed