BDBM50098590 Sodium Selenocyanate
SMILES [Na+].[Se-]C#N
InChI Key InChIKey=IBJRLHARKKQREK-UHFFFAOYSA-M
Data  5 KI
  Tab Delimited (TSV)   2D SDfile   Computed 3D by Vconf -m prep SDfile
Find this compound or compounds like it in BindingDB:
Activity Spreadsheet -- Enzyme Inhibition Constant Data from BindingDB
Found 5 hits for monomerid = 50098590
TargetCarbonic anhydrase 1(Homo sapiens (Human))
University Of Tampere And Tampere University Hospital
Curated by ChEMBL
LigandPNGBDBM50098590(Sodium Selenocyanate)
Affinity DataKi:  8.50E+4nM. Assay description: Inhibition of human carbonic anhydrase-1 at 20 degC preincubated for 15 mins by stopped-flow CO2 hydrase assay
In DepthDetails ArticlePubMed
TargetCarbonic anhydrase 2(Homo sapiens (Human))
Istituto Di Bioscienze E Biorisorse
Curated by ChEMBL
LigandPNGBDBM50098590(Sodium Selenocyanate)
Affinity DataKi:  8.60E+4nM. Assay description: Inhibition of human CA2 after 15 mins by stopped-flow/Co2 hydration assay
In DepthDetails ArticlePubMed
TargetCarbonic anhydrase 2(Homo sapiens (Human))
Istituto Di Bioscienze E Biorisorse
Curated by ChEMBL
LigandPNGBDBM50098590(Sodium Selenocyanate)
Affinity DataKi:  8.60E+4nM. Assay description: Inhibition of human carbonic anhydrase-2 by CO2 hydration reaction based colorimetric stopped-flow method
In DepthDetails ArticlePubMed
TargetCarbonic anhydrase 2(Homo sapiens (Human))
Istituto Di Bioscienze E Biorisorse
Curated by ChEMBL
LigandPNGBDBM50098590(Sodium Selenocyanate)
Affinity DataKi:  8.60E+4nM. Assay description: Inhibition of human recombinant carbonic anhydrase 2 assessed as inhibition of CO2 hydration preincubated for 15 mins by Lineweaver-burk plot method
In DepthDetails ArticlePubMed
TargetCarbonic anhydrase(Pseudomonas aeruginosa (strain ATCC 15692 / PAO1 /...)
University Of Florida
Curated by ChEMBL
LigandPNGBDBM50098590(Sodium Selenocyanate)
Affinity DataKi:  6.80E+5nMpH: 8.3Assay Description:Inhibition of Pseudomonas aeruginosa PAO1 type-2 beta-carbonic anhydrase psCA3 expressed in Escherichia coli Tuner BL21 (DE3) cells pre-incubated for...
In DepthDetails ArticlePubMed