BDBM50098708 CHEMBL3594306
SMILES Nc1nccc2cc(N[C@H]3c4ccc(CCCC(=O)Nc5cccc(CNC3=O)c5)cc4)ccc12
InChI Key InChIKey=LXFPTSIBSQOGTO-SANMLTNESA-N
Data  1 KI
  Tab Delimited (TSV)   2D SDfile   Computed 3D by Vconf -m prep SDfile
Find this compound or compounds like it in BindingDB:
Activity Spreadsheet -- Enzyme Inhibition Constant Data from BindingDB
Found 1 hit for monomerid = 50098708
TargetCoagulation factor VII/Tissue factor(Homo sapiens (Human))
TBA
Curated by ChEMBL
LigandPNGBDBM50098708(CHEMBL3594306)
Affinity DataKi: >1.80E+4nM. Assay description: Inhibition of human recombinant TF/F7a complex using S2288 as substrate preincubated for 15 mins followed by protein addition measured for 60 mins
In DepthDetails ArticlePubMed