BDBM50098796 CHEMBL3593470
SMILES Clc1cc(N\N=C(/C#N)C(=O)c2cc(on2)C2CC2)cc(Cl)c1Cl
InChI Key InChIKey=UBDCAVGSNQATLH-CIAFOILYSA-N
Data  2 IC50
  Tab Delimited (TSV)   2D SDfile   Computed 3D by Vconf -m prep SDfile
Find this compound or compounds like it in BindingDB:
Activity Spreadsheet -- Enzyme Inhibition Constant Data from BindingDB
Found 2 hits for monomerid = 50098796
TargetRap guanine nucleotide exchange factor 3(Homo sapiens (Human))
University Of Texas Medical Branch
Curated by ChEMBL
LigandPNGBDBM50098796(CHEMBL3593470)
Affinity DataIC50:  4.10E+3nM. Assay description: Antagonist activity at human recombinant EPAC1 assessed as inhibition of Rap1b-bGDP exchange activity
In DepthDetails ArticlePubMed
TargetRap guanine nucleotide exchange factor 4(Mus musculus)
University Of Texas Medical Branch
Curated by ChEMBL
LigandPNGBDBM50098796(CHEMBL3593470)
Affinity DataIC50:  8.80E+3nM. Assay description: Displacement of 8-NBD-cAMP from mouse recombinant EPAC2 by fluorescence assay
In DepthDetails ArticlePubMed