BDBM50098845 2-[5-Amino-2-(4-fluoro-phenyl)-6-oxo-6H-pyrimidin-1-yl]-N-(2-benzothiazol-2-yl-1-benzyl-2-oxo-ethyl)-acetamide::CHEMBL26342
SMILES Nc1cnc(-c2ccc(F)cc2)n(CC(=O)NC(Cc2ccccc2)C(=O)c2nc3ccccc3s2)c1=O
InChI Key InChIKey=TXYNDCNOFANBEU-UHFFFAOYSA-N
Data  2 KI
  Tab Delimited (TSV)   2D SDfile   Computed 3D by Vconf -m prep SDfile
Find this compound or compounds like it in BindingDB:
Activity Spreadsheet -- Enzyme Inhibition Constant Data from BindingDB
Found 2 hits for monomerid = 50098845
TargetChymotrypsinogen A(Bos taurus (bovine))
Welfide
Curated by ChEMBL
LigandPNGBDBM50098845(2-[5-Amino-2-(4-fluoro-phenyl)-6-oxo-6H-pyrimidin-...)
Affinity DataKi:  166nM. Assay description: Inhibitory activity against alpha chymotrypsin from bovine pancreas.
In DepthDetails ArticlePubMed
TargetChymase(Homo sapiens (Human))
Welfide
Curated by ChEMBL
LigandPNGBDBM50098845(2-[5-Amino-2-(4-fluoro-phenyl)-6-oxo-6H-pyrimidin-...)
Affinity DataKi:  182nM. Assay description: Inhibitory activity evaluated against chymase from human heart.
In DepthDetails ArticlePubMed