BDBM50098851 2-[5-Amino-2-(4-fluoro-phenyl)-6-oxo-6H-pyrimidin-1-yl]-N-[1-benzyl-2-(5-fluoro-benzooxazol-2-yl)-2-oxo-ethyl]-acetamide::CHEMBL26171
SMILES Nc1cnc(-c2ccc(F)cc2)n(CC(=O)NC(Cc2ccccc2)C(=O)c2nc3cc(F)ccc3o2)c1=O
InChI Key InChIKey=LJJRCMBYBCDTEQ-UHFFFAOYSA-N
Data  2 KI
  Tab Delimited (TSV)   2D SDfile   Computed 3D by Vconf -m prep SDfile
Find this compound or compounds like it in BindingDB:
Activity Spreadsheet -- Enzyme Inhibition Constant Data from BindingDB
Found 2 hits for monomerid = 50098851
TargetChymotrypsinogen A(Bos taurus (bovine))
Welfide
Curated by ChEMBL
LigandPNGBDBM50098851(2-[5-Amino-2-(4-fluoro-phenyl)-6-oxo-6H-pyrimidin-...)
Affinity DataKi:  65.1nM. Assay description: Inhibitory activity against alpha chymotrypsin from bovine pancreas.
In DepthDetails ArticlePubMed
TargetChymase(Homo sapiens (Human))
Welfide
Curated by ChEMBL
LigandPNGBDBM50098851(2-[5-Amino-2-(4-fluoro-phenyl)-6-oxo-6H-pyrimidin-...)
Affinity DataKi:  93.1nM. Assay description: Inhibitory activity evaluated against chymase from human heart.
In DepthDetails ArticlePubMed