BDBM50098858 2-(2-{2-[5-Amino-2-(4-fluoro-phenyl)-6-oxo-6H-pyrimidin-1-yl]-acetylamino}-3-phenyl-propionyl)-benzooxazole-5-carboxylic acid amide::CHEMBL26011
SMILES NC(=O)c1ccc2oc(nc2c1)C(=O)C(Cc1ccccc1)NC(=O)Cn1c(ncc(N)c1=O)-c1ccc(F)cc1
InChI Key InChIKey=VAOGLIYVHPRMHX-UHFFFAOYSA-N
Data  2 KI
  Tab Delimited (TSV)   2D SDfile   Computed 3D by Vconf -m prep SDfile
Find this compound or compounds like it in BindingDB:
Activity Spreadsheet -- Enzyme Inhibition Constant Data from BindingDB
Found 2 hits for monomerid = 50098858
TargetChymotrypsinogen A(Bos taurus (bovine))
Welfide
Curated by ChEMBL
LigandPNGBDBM50098858(2-(2-{2-[5-Amino-2-(4-fluoro-phenyl)-6-oxo-6H-pyri...)
Affinity DataKi:  53.4nM. Assay description: Inhibitory activity against alpha chymotrypsin from bovine pancreas.
In DepthDetails ArticlePubMed
TargetChymase(Homo sapiens (Human))
Welfide
Curated by ChEMBL
LigandPNGBDBM50098858(2-(2-{2-[5-Amino-2-(4-fluoro-phenyl)-6-oxo-6H-pyri...)
Affinity DataKi:  94nM. Assay description: Inhibitory activity evaluated against chymase from human heart.
In DepthDetails ArticlePubMed