BDBM50099337 4-{4-[5-(4-Fluoro-phenyl)-3-piperidin-4-yl-3H-imidazol-4-yl]-pyrimidin-2-yloxy}-benzonitrile::CHEMBL13972
SMILES Fc1ccc(cc1)-c1ncn(C2CCNCC2)c1-c1ccnc(Oc2ccc(cc2)C#N)n1
InChI Key InChIKey=JQHSODWZKVGCLV-UHFFFAOYSA-N
Data  2 IC50
  Tab Delimited (TSV)   2D SDfile   Computed 3D by Vconf -m prep SDfile
Find this compound or compounds like it in BindingDB:
Activity Spreadsheet -- Enzyme Inhibition Constant Data from BindingDB
Found 2 hits for monomerid = 50099337
TargetMitogen-activated protein kinase 14(Homo sapiens (Human))
University College Of Pharmaceutical Sciences
Curated by ChEMBL
LigandPNGBDBM50099337(4-{4-[5-(4-Fluoro-phenyl)-3-piperidin-4-yl-3H-imid...)
Affinity DataIC50:  177nM. Assay description: Inhibition of p38alpha
In DepthDetails ArticlePubMed
TargetMitogen-activated protein kinase 14(Homo sapiens (Human))
University College Of Pharmaceutical Sciences
Curated by ChEMBL
LigandPNGBDBM50099337(4-{4-[5-(4-Fluoro-phenyl)-3-piperidin-4-yl-3H-imid...)
Affinity DataIC50:  177nM. Assay description: Inhibitory concentration against mitogen-activated protein kinase p38 alpha
In DepthDetails ArticlePubMed