BDBM50099637 3-(4-Isobutyryl-piperazin-1-ylmethyl)-2-phenyl-quinoline-4-carboxylic acid (1-cyclohexyl-ethyl)-amide::CHEMBL45961
SMILES CC(C)C(=O)N1CCN(Cc2c(nc3ccccc3c2C(=O)N[C@@H](C)C2CCCCC2)-c2ccccc2)CC1
InChI Key InChIKey=VVQLVPFUZGSGAS-DEOSSOPVSA-N
Data  3 KI
  Tab Delimited (TSV)   2D SDfile   Computed 3D by Vconf -m prep SDfile
Find this compound or compounds like it in BindingDB:
Activity Spreadsheet -- Enzyme Inhibition Constant Data from BindingDB
Found 3 hits for monomerid = 50099637
TargetSubstance-K receptor(Homo sapiens (Human))
Smithkline Beecham Pharmaceuticals
Curated by ChEMBL
LigandPNGBDBM50099637(3-(4-Isobutyryl-piperazin-1-ylmethyl)-2-phenyl-qui...)
Affinity DataKi:  1.20nM. Assay description: Displacement of [125 I]-NKA binding to tachykinin receptor 2 in CHO membranes
In DepthDetails ArticlePubMed
TargetNeuromedin-K receptor(Homo sapiens (Human))
Smithkline Beecham Pharmaceuticals
Curated by ChEMBL
LigandPNGBDBM50099637(3-(4-Isobutyryl-piperazin-1-ylmethyl)-2-phenyl-qui...)
Affinity DataKi:  1.40nM. Assay description: Displacement of [125 I]-[MePhe]-NKB binding to hNK-3-CHO (Chinese hamster ovary) membranes
In DepthDetails ArticlePubMed
TargetMu-type opioid receptor(Homo sapiens (Human))
Smithkline Beecham Pharmaceuticals
Curated by ChEMBL
LigandPNGBDBM50099637(3-(4-Isobutyryl-piperazin-1-ylmethyl)-2-phenyl-qui...)
Affinity DataKi: >2.50E+3nM. Assay description: Binding affinity towards human mu-opioid receptors in CHO (Chinese hamster ovary) cell lines
In DepthDetails ArticlePubMed