BDBM50099660 CHEMBL3319479
SMILES COc1ccc(C[C@H](NC(=O)[C@H](C)NC(=O)CN2CCOCC2)C(=O)N[C@@H](Cc2ccc3ccccc3c2)C(=O)[C@@]2(C)CO2)cc1
InChI Key InChIKey=XQXSDLXMWORERB-UHFFFAOYSA-N
Data  1 IC50
  Tab Delimited (TSV)   2D SDfile   Computed 3D by Vconf -m prep SDfile
Find this compound or compounds like it in BindingDB:
Activity Spreadsheet -- Enzyme Inhibition Constant Data from BindingDB
Found 1 hit for monomerid = 50099660
TargetProteasome subunit beta type-8(Homo sapiens (Human))
Leiden Institute Of Chemistry And Netherlands Proteomics Centre
Curated by ChEMBL
LigandPNGBDBM50099660(CHEMBL3319479)
Affinity DataIC50:  3.10nM. Assay description: Inhibition of proteasome subunit beta-5i in human Raji cells using BODIPY-NC005 by fluorescent densitometry
In DepthDetails ArticlePubMed