BDBM50099708 1-(4-Carbamoyl-2-{[1-(4-carbamoyl-2-{4-carboxy-2-[(9,10-dioxo-9,10-dihydro-phenanthrene-3-carbonyl)-amino]-butyrylamino}-butyryl)-pyrrolidine-2-carbonyl]-amino}-butyryl)-pyrrolidine-2-carboxylic acid::CHEMBL51885
SMILES NC(=O)CCC(NC(=O)C(CCC(O)=O)NC(=O)c1ccc2C(=O)C(=O)c3ccccc3-c2c1)C(=O)N1CCCC1C(=O)NC(CCC(N)=O)C(=O)N1CCCC1C(O)=O
InChI Key InChIKey=OTSLSPBCSJRGIN-UHFFFAOYSA-N
Data  1 IC50
  Tab Delimited (TSV)   2D SDfile   Computed 3D by Vconf -m prep SDfile
Find this compound or compounds like it in BindingDB:
Activity Spreadsheet -- Enzyme Inhibition Constant Data from BindingDB
Found 1 hit for monomerid = 50099708
TargetReceptor-type tyrosine-protein phosphatase C(Homo sapiens (Human))
Astrazeneca Pharmaceuticals
Curated by ChEMBL
LigandPNGBDBM50099708(1-(4-Carbamoyl-2-{[1-(4-carbamoyl-2-{4-carboxy-2-[...)
Affinity DataIC50:  600nM. Assay description: In vitro inhibitory activity against the cytosolic portion of CD45 protein-tyrosine phosphatase using pNPP as the substrate
In DepthDetails ArticlePubMed