BDBM50099809 4-Bromo-1-methoxy-naphthalene-2-carboxylic acid (1-benzyl-pyrrolidin-2-ylmethyl)-amide::CHEMBL53102
SMILES COc1c(cc(Br)c2ccccc12)C(=O)NC[C@H]1CCCN1Cc1ccccc1
InChI Key InChIKey=UGGRLDVMPAOIFF-GOSISDBHSA-N
Data  3 KI
  Tab Delimited (TSV)   2D SDfile   Computed 3D by Vconf -m prep SDfile
Find this compound or compounds like it in BindingDB:
Activity Spreadsheet -- Enzyme Inhibition Constant Data from BindingDB
Found 3 hits for monomerid = 50099809
TargetD(3) dopamine receptor(Rattus norvegicus (Rat))
Wake Forest University School Of Medicine
Curated by ChEMBL
LigandPNGBDBM50099809(4-Bromo-1-methoxy-naphthalene-2-carboxylic acid (1...)
Affinity DataKi:  1.40nM. Assay description: Binding affinity for dopamine receptor D3 expressed in Sf9 cells using [125I]-IABN the radioligand.
In DepthDetails ArticlePubMed
TargetD(2) dopamine receptor(Rattus norvegicus (rat))
Wake Forest University School Of Medicine
Curated by ChEMBL
LigandPNGBDBM50099809(4-Bromo-1-methoxy-naphthalene-2-carboxylic acid (1...)
Affinity DataKi:  11.4nM. Assay description: Binding affinity for dopamine receptor D2 long expressed in Sf9 cells using [125I]-IABN radioligand.
In DepthDetails ArticlePubMed
TargetSigma non-opioid intracellular receptor 1(Homo sapiens (Human))
Wake Forest University School Of Medicine
Curated by ChEMBL
LigandPNGBDBM50099809(4-Bromo-1-methoxy-naphthalene-2-carboxylic acid (1...)
Affinity DataKi:  230nM. Assay description: Binding affinity for sigma-1 receptor measured on guinea pig brain membranes using [3H]-(+)-pentazocine as radioligand.
In DepthDetails ArticlePubMed