BDBM50099811 4-Bromo-1-methoxy-naphthalene-2-carboxylic acid (9-cyclohexyl-9-aza-bicyclo[3.3.1]non-3-yl)-amide::CHEMBL423122
SMILES COc1c(cc(Br)c2ccccc12)C(=O)NC1CC2CCCC(C1)N2C1CCCCC1
InChI Key InChIKey=OBVLIYLZARBQBE-UHFFFAOYSA-N
Data  3 KI
  Tab Delimited (TSV)   2D SDfile   Computed 3D by Vconf -m prep SDfile
Find this compound or compounds like it in BindingDB:
Activity Spreadsheet -- Enzyme Inhibition Constant Data from BindingDB
Found 3 hits for monomerid = 50099811
TargetD(3) dopamine receptor(Rattus norvegicus (Rat))
Wake Forest University School Of Medicine
Curated by ChEMBL
LigandPNGBDBM50099811(4-Bromo-1-methoxy-naphthalene-2-carboxylic acid (9...)
Affinity DataKi:  48nM. Assay description: Binding affinity for dopamine receptor D3 expressed in Sf9 cells using [125I]-IABN the radioligand.
In DepthDetails ArticlePubMed
TargetSigma non-opioid intracellular receptor 1(Homo sapiens (Human))
Wake Forest University School Of Medicine
Curated by ChEMBL
LigandPNGBDBM50099811(4-Bromo-1-methoxy-naphthalene-2-carboxylic acid (9...)
Affinity DataKi:  69nM. Assay description: Binding affinity for sigma-1 receptor measured on guinea pig brain membranes using [3H]-(+)-pentazocine as radioligand.
In DepthDetails ArticlePubMed
TargetD(2) dopamine receptor(Rattus norvegicus (rat))
Wake Forest University School Of Medicine
Curated by ChEMBL
LigandPNGBDBM50099811(4-Bromo-1-methoxy-naphthalene-2-carboxylic acid (9...)
Affinity DataKi:  150nM. Assay description: Binding affinity for dopamine receptor D2 long expressed in Sf9 cells using [125I]-IABN radioligand.
In DepthDetails ArticlePubMed