BDBM50099932 5-Methylsulfanyl-4-(2-phenyl-thiazol-4-yl)-thiophene-2-carboxamidine::CHEMBL29250
SMILES CSc1sc(cc1-c1csc(n1)-c1ccccc1)C(N)=N
InChI Key InChIKey=GDERVCXRALFKIF-UHFFFAOYSA-N
Data  1 KI
  Tab Delimited (TSV)   2D SDfile   Computed 3D by Vconf -m prep SDfile
Find this compound or compounds like it in BindingDB:
Activity Spreadsheet -- Enzyme Inhibition Constant Data from BindingDB
Found 1 hit for monomerid = 50099932
TargetUrokinase-type plasminogen activator(Homo sapiens (Human))
3-Dimensional Pharmaceuticals
Curated by ChEMBL
LigandPNGBDBM50099932(5-Methylsulfanyl-4-(2-phenyl-thiazol-4-yl)-thiophe...)
Affinity DataKi:  200nM. Assay description: Inhibitory activity against serine protease urokinase-type plasminogen activator (microPa)
In DepthDetails ArticlePubMed