BDBM50100021 (S)-2-[(Naphthalene-1-carbonyl)-amino]-3-(4-nitro-phenyl)-propionic acid methyl ester::CHEMBL33227
SMILES COC(=O)[C@H](Cc1ccc(cc1)[N+]([O-])=O)NC(=O)c1cccc2ccccc12
InChI Key InChIKey=VMFGCGRAIBLAFY-IBGZPJMESA-N
Data  11 IC50  1 EC50
  Tab Delimited (TSV)   2D SDfile   Computed 3D by Vconf -m prep SDfile
Find this compound or compounds like it in BindingDB:
Activity Spreadsheet -- Enzyme Inhibition Constant Data from BindingDB
Found 12 hits for monomerid = 50100021
TargetC-C chemokine receptor type 3(Homo sapiens (Human))
Smithkline Beecham Pharmaceuticals
Curated by ChEMBL
LigandPNGBDBM50100021((S)-2-[(Naphthalene-1-carbonyl)-amino]-3-(4-nitro-...)
Affinity DataIC50: >330nM. Assay description: Agonistic activity of the compound against C-C chemokine receptor type 3 by displacing MCP-4 radioligand,using Esonophil chemotaxis assay
In DepthDetails ArticlePubMed
TargetC-C chemokine receptor type 3(Homo sapiens (Human))
Smithkline Beecham Pharmaceuticals
Curated by ChEMBL
LigandPNGBDBM50100021((S)-2-[(Naphthalene-1-carbonyl)-amino]-3-(4-nitro-...)
Affinity DataIC50:  5nM. Assay description: Antagonist activity against C-C chemokine receptor type 3
In DepthDetails ArticlePubMed
TargetC-C chemokine receptor type 3(Homo sapiens (Human))
Smithkline Beecham Pharmaceuticals
Curated by ChEMBL
LigandPNGBDBM50100021((S)-2-[(Naphthalene-1-carbonyl)-amino]-3-(4-nitro-...)
Affinity DataIC50:  5nM. Assay description: Binding affinity was determined towards C-C chemokine receptor type 3 using [125I]-labeled eotaxin as radioligand
In DepthDetails ArticlePubMed
TargetC-C chemokine receptor type 3(Homo sapiens (Human))
Smithkline Beecham Pharmaceuticals
Curated by ChEMBL
LigandPNGBDBM50100021((S)-2-[(Naphthalene-1-carbonyl)-amino]-3-(4-nitro-...)
Affinity DataEC50:  780nM. Assay description: Antagonist activity at human EGFP-fused CCR3 expressed in mouse L1.2 cells assessed as inhibition of CCL11-induced chemotaxis measured after 1.5 hrs ...
In DepthDetails ArticlePubMed
TargetC-C chemokine receptor type 3(Homo sapiens (Human))
Smithkline Beecham Pharmaceuticals
Curated by ChEMBL
LigandPNGBDBM50100021((S)-2-[(Naphthalene-1-carbonyl)-amino]-3-(4-nitro-...)
Affinity DataIC50:  35nM. Assay description: Inhibitory activity against human eosinophil C-C chemokine receptor type 3 using [125I]- human eotaxin as the radioligand
In DepthDetails ArticlePubMed
TargetC-C chemokine receptor type 3(Homo sapiens (Human))
Smithkline Beecham Pharmaceuticals
Curated by ChEMBL
LigandPNGBDBM50100021((S)-2-[(Naphthalene-1-carbonyl)-amino]-3-(4-nitro-...)
Affinity DataIC50:  25nM. Assay description: Agonistic activity of the compound against C-C chemokine receptor type 3 by displacing Eotaxin radioligand,using Esonophil chemotaxis assay
In DepthDetails ArticlePubMed
TargetC-C chemokine receptor type 3(Homo sapiens (Human))
Smithkline Beecham Pharmaceuticals
Curated by ChEMBL
LigandPNGBDBM50100021((S)-2-[(Naphthalene-1-carbonyl)-amino]-3-(4-nitro-...)
Affinity DataIC50:  38nM. Assay description: Agonistic activity of the compound against C-C chemokine receptor type 3 by displacing [125I]-MCP-4 radioligand,using CCR3 binding assay
In DepthDetails ArticlePubMed
TargetC-C chemokine receptor type 3(Homo sapiens (Human))
Smithkline Beecham Pharmaceuticals
Curated by ChEMBL
LigandPNGBDBM50100021((S)-2-[(Naphthalene-1-carbonyl)-amino]-3-(4-nitro-...)
Affinity DataIC50:  7nM. Assay description: Agonistic activity of the compound against C-C chemokine receptor type 3 by displacing Eotaxin-2 radioligand,using [Ca2+] mobilization assay
In DepthDetails ArticlePubMed
TargetC-C chemokine receptor type 3(Homo sapiens (Human))
Smithkline Beecham Pharmaceuticals
Curated by ChEMBL
LigandPNGBDBM50100021((S)-2-[(Naphthalene-1-carbonyl)-amino]-3-(4-nitro-...)
Affinity DataIC50:  5nM. Assay description: Agonistic activity of the compound against C-C chemokine receptor type 3 by displacing Eotaxin radioligand,using [Ca2+] mobilization assay
In DepthDetails ArticlePubMed
TargetC-C chemokine receptor type 3(Homo sapiens (Human))
Smithkline Beecham Pharmaceuticals
Curated by ChEMBL
LigandPNGBDBM50100021((S)-2-[(Naphthalene-1-carbonyl)-amino]-3-(4-nitro-...)
Affinity DataIC50:  32nM. Assay description: Agonistic activity of the compound against C-C chemokine receptor type 3 by displacing Eotaxin radioligand,using Esonophil chemotaxis assay
In DepthDetails ArticlePubMed
TargetC-C chemokine receptor type 3(Homo sapiens (Human))
Smithkline Beecham Pharmaceuticals
Curated by ChEMBL
LigandPNGBDBM50100021((S)-2-[(Naphthalene-1-carbonyl)-amino]-3-(4-nitro-...)
Affinity DataIC50:  32nM. Assay description: Agonistic activity of the compound against C-C chemokine receptor type 3 by displacing Eotaxin radioligand,using Esonophil chemotaxis assay
In DepthDetails ArticlePubMed
TargetC-C chemokine receptor type 3(Homo sapiens (Human))
Smithkline Beecham Pharmaceuticals
Curated by ChEMBL
LigandPNGBDBM50100021((S)-2-[(Naphthalene-1-carbonyl)-amino]-3-(4-nitro-...)
Affinity DataIC50:  35nM. Assay description: Agonistic activity of the compound against C-C chemokine receptor type 3 by displacing Eotaxin radioligand,using Esonophil chemotaxis assay
In DepthDetails ArticlePubMed