BDBM50100417 (1R,2S,4S,5S)-4-(2-Chloro-6-cyclopentylamino-purin-9-yl)-1-hydroxymethyl-bicyclo[3.1.0]hexan-2-ol::CHEMBL27593
SMILES OC[C@@]12C[C@@H]1[C@H](C[C@@H]2O)n1cnc2c(NC3CCCC3)nc(Cl)nc12
InChI Key InChIKey=JKXQVOVVTTUXHT-QLQJRFMMSA-N
Data  2 KI  1 EC50
  Tab Delimited (TSV)   2D SDfile   Computed 3D by Vconf -m prep SDfile
Find this compound or compounds like it in BindingDB:
Activity Spreadsheet -- Enzyme Inhibition Constant Data from BindingDB
Found 3 hits for monomerid = 50100417
TargetAdenosine receptor A3(Homo sapiens (Human))
Niddk
Curated by ChEMBL
LigandPNGBDBM50100417((1R,2S,4S,5S)-4-(2-Chloro-6-cyclopentylamino-purin...)
Affinity DataKi:  1.09E+3nM. Assay description: Ability to displace specific radioligand [125I]AB-MECA binding at human Adenosine A3 receptor expressed in CHO cells
In DepthDetails ArticlePubMed
TargetAdenosine receptor A1(Rattus norvegicus (rat))
Niddk
Curated by ChEMBL
LigandPNGBDBM50100417((1R,2S,4S,5S)-4-(2-Chloro-6-cyclopentylamino-purin...)
Affinity DataKi:  3.60E+3nM. Assay description: Ability to displace specific radioligand [3H]R-PIA binding at Adenosine A1 receptor in rat brain membrane
In DepthDetails ArticlePubMed
TargetAdenosine receptor A1(Homo sapiens (Human))
Niddk
Curated by ChEMBL
LigandPNGBDBM50100417((1R,2S,4S,5S)-4-(2-Chloro-6-cyclopentylamino-purin...)
Affinity DataEC50:  2.28E+3nM. Assay description: Agonist efficacy as effective concentration to stimulate binding of [35S]GTP-gamma-S, at human Adenosine A1 receptor
In DepthDetails ArticlePubMed