BDBM50100486 3-Chloro-N-(4-hydroxy-5-hydroxymethyl-2-{6-[(naphthalen-1-ylmethyl)-amino]-9H-purin-3-ylmethyl}-tetrahydro-furan-3-yl)-benzamide::CHEMBL291421
SMILES OC[C@H]1O[C@H]([C@H](NC(=O)c2cccc(Cl)c2)[C@@H]1O)n1cnc2c(NCc3cccc4ccccc34)ncnc12
InChI Key InChIKey=NTACAHYKGSHJIZ-XABBOIKWSA-N
Data  1 IC50
  Tab Delimited (TSV)   2D SDfile   Computed 3D by Vconf -m prep SDfile
Find this compound or compounds like it in BindingDB:
Activity Spreadsheet -- Enzyme Inhibition Constant Data from BindingDB
Found 1 hit for monomerid = 50100486
TargetGlyceraldehyde-3-phosphate dehydrogenase, cytosolic(Leishmania mexicana)
University Of Washington
Curated by ChEMBL
LigandPNGBDBM50100486(3-Chloro-N-(4-hydroxy-5-hydroxymethyl-2-{6-[(napht...)
Affinity DataIC50:  6.00E+3nM. Assay description: Inhibitory activity against Leishmania mexicana GAPDH
In DepthDetails ArticlePubMed