BDBM50100529 CHEMBL3327080
SMILES CC[C@H](C)C(=O)N1CCC(CC(=O)Nc2ccc(OC(F)(F)F)cc2)CC1
InChI Key InChIKey=FYHLDHDZFQKNFY-ZDUSSCGKSA-N
Data  1 KI
  Tab Delimited (TSV)   2D SDfile   Computed 3D by Vconf -m prep SDfile
Find this compound or compounds like it in BindingDB:
Activity Spreadsheet -- Enzyme Inhibition Constant Data from BindingDB
Found 1 hit for monomerid = 50100529
TargetBifunctional epoxide hydrolase 2(Homo sapiens (Human))
University Of California Davis
Curated by ChEMBL
LigandPNGBDBM50100529(CHEMBL3327080)
Affinity DataKi:  11nM. Assay description: Inhibition of human recombinant soluble epoxide hydrolase by FRET-based ACPU displacement assay
In DepthDetails ArticlePubMed