BDBM50100538 CHEMBL3327070
SMILES FC(F)(F)CCC(=O)N1CCC(CC1)NC(=O)Nc1ccc(cc1)C(F)(F)F
InChI Key InChIKey=ZWUAPSAUHLJRRI-UHFFFAOYSA-N
Data  1 KI  2 IC50
  Tab Delimited (TSV)   2D SDfile   Computed 3D by Vconf -m prep SDfile
Find this compound or compounds like it in BindingDB:
Activity Spreadsheet -- Enzyme Inhibition Constant Data from BindingDB
Found 3 hits for monomerid = 50100538
TargetBifunctional epoxide hydrolase 2(Homo sapiens (Human))
University Of California Davis
Curated by ChEMBL
LigandPNGBDBM50100538(CHEMBL3327070)
Affinity DataKi:  1.20nM. Assay description: Inhibition of human recombinant soluble epoxide hydrolase by FRET-based ACPU displacement assay
In DepthDetails ArticlePubMed
TargetBifunctional epoxide hydrolase 2(Mus musculus (Mouse))
The Regents Of The University Of California
US Patent
LigandPNGBDBM50100538(CHEMBL3327070)
Affinity DataIC50:  9.30nM. Assay description: fluoresence competitive assay.
In DepthDetails US Patent
TargetBifunctional epoxide hydrolase 2(Mus musculus (Mouse))
The Regents Of The University Of California
US Patent
LigandPNGBDBM50100538(CHEMBL3327070)
Affinity DataIC50:  70.8nM. Assay description: Trans-diphenylpropene oxide is used in a radiometric competitive assay.
In DepthDetails US Patent