BDBM50101689 CHEMBL3394909
SMILES COc1cc(\C=N\NC(=O)c2ccc(NC(=O)c3ccccc3)cc2)ccc1O
InChI Key InChIKey=BZTQRVPSUHEVMW-OEAKJJBVSA-N
Data  1 IC50
  Tab Delimited (TSV)   2D SDfile   Computed 3D by Vconf -m prep SDfile
Find this compound or compounds like it in BindingDB:
Activity Spreadsheet -- Enzyme Inhibition Constant Data from BindingDB
Found 1 hit for monomerid = 50101689
TargetHistone chaperone ASF1A(Homo sapiens (Human))
Colorado State University
Curated by ChEMBL
LigandPNGBDBM50101689(CHEMBL3394909)
Affinity DataIC50: >1.00E+5nM. Assay description: Inhibition of His-tagged human Asf1a binding with H3/H4 assessed as fluorescence intensity after 30 mins by ALPHA assay
In DepthDetails ArticlePubMed