BDBM50102656 CHEMBL3343015
SMILES Oc1c(oc2ccccc2c1=O)-c1cc(Br)ccc1F
InChI Key InChIKey=OGIJEXWCHFAYRS-UHFFFAOYSA-N
Data  1 EC50
  Tab Delimited (TSV)   2D SDfile   Computed 3D by Vconf -m prep SDfile
Find this compound or compounds like it in BindingDB:
Activity Spreadsheet -- Enzyme Inhibition Constant Data from BindingDB
Found 1 hit for monomerid = 50102656
TargetNeuromedin-U receptor 2(Homo sapiens (Human))
East China Normal University
Curated by ChEMBL
LigandPNGBDBM50102656(CHEMBL3343015)
Affinity DataEC50:  1.40E+4nM. Assay description: Agonist activity at human NMU2R transfected in HEK293 cells after 7 hrs by luciferase reporter gene assay
In DepthDetails ArticlePubMed