BDBM50103772 (5,7-Difluoro-naphthalen-1-yl)-(4-{2-[4-(4-methoxy-benzenesulfonyl)-phenyl]-[1,3]dioxolan-2-yl}-[1,4']bipiperidinyl-1'-yl)-methanone::CHEMBL75108
SMILES COc1ccc(cc1)S(=O)(=O)c1ccc(cc1)C1(OCCO1)C1CCN(CC1)C1CCN(CC1)C(=O)c1cccc2c(F)cc(F)cc12
InChI Key InChIKey=AQTWXHKJEFVDRR-UHFFFAOYSA-N
Data  1 KI
  Tab Delimited (TSV)   2D SDfile   Computed 3D by Vconf -m prep SDfile
Find this compound or compounds like it in BindingDB:
Activity Spreadsheet -- Enzyme Inhibition Constant Data from BindingDB
Found 1 hit for monomerid = 50103772
TargetMuscarinic acetylcholine receptor M2(Homo sapiens (Human))
Schering-Plough Research Institute
Curated by ChEMBL
LigandPNGBDBM50103772((5,7-Difluoro-naphthalen-1-yl)-(4-{2-[4-(4-methoxy...)
Affinity DataKi:  0.230nM. Assay description: Antagonistic activity of the compound against Muscarinic acetylcholine receptor M2
In DepthDetails ArticlePubMed