BDBM50103981 CHEMBL3593906
SMILES O=C1N(Cc2ccccc2)c2ccccc2\C1=C\C=C\c1ccccc1
InChI Key InChIKey=VELVOYXHSYTAQT-GYPNLSDOSA-N
Data  3 KI
  Tab Delimited (TSV)   2D SDfile   Computed 3D by Vconf -m prep SDfile
Find this compound or compounds like it in BindingDB:
Activity Spreadsheet -- Enzyme Inhibition Constant Data from BindingDB
Found 3 hits for monomerid = 50103981
TargetAlpha-synuclein(Homo sapiens (Human))
Washington University
Curated by ChEMBL
LigandPNGBDBM50103981(CHEMBL3593906)
Affinity DataKi:  227nM. Assay description: Displacement of Thio-T from recombinant alpha-synuclein (unknown origin) expressed in Escherichia coli after 1.5 hrs by fluorescence assay
In DepthDetails ArticlePubMed
TargetMicrotubule-associated protein tau(Homo sapiens (Human))
Washington University
Curated by ChEMBL
LigandPNGBDBM50103981(CHEMBL3593906)
Affinity DataKi:  682nM. Assay description: Displacement of Thio-T from human recombinant tau (243 to 375) expressed in Escherichia coli BL21(DE3)RIL after 1.5 hrs by fluorescence assay
In DepthDetails ArticlePubMed
TargetAmyloid-beta precursor protein(Homo sapiens (Human))
Washington University
Curated by ChEMBL
LigandPNGBDBM50103981(CHEMBL3593906)
Affinity DataKi:  703nM. Assay description: Displacement of Thio-T from amyloid beta (1 to 42) (unknown origin) expressed in Escherichia coli after 1.5 hrs by fluorescence assay
In DepthDetails ArticlePubMed