BDBM50104034 CHEMBL3593907
SMILES COc1ccc(\C=C\C=C2/C(=O)N(Cc3ccccc3)c3ccccc23)cc1
InChI Key InChIKey=PPISZIMXPLLQGN-MLDDFNBGSA-N
Data  3 KI
  Tab Delimited (TSV)   2D SDfile   Computed 3D by Vconf -m prep SDfile
Find this compound or compounds like it in BindingDB:
Activity Spreadsheet -- Enzyme Inhibition Constant Data from BindingDB
Found 3 hits for monomerid = 50104034
TargetAlpha-synuclein(Homo sapiens (Human))
Washington University
Curated by ChEMBL
LigandPNGBDBM50104034(CHEMBL3593907)
Affinity DataKi:  73nM. Assay description: Displacement of Thio-T from recombinant alpha-synuclein (unknown origin) expressed in Escherichia coli after 1.5 hrs by fluorescence assay
In DepthDetails ArticlePubMed
TargetMicrotubule-associated protein tau(Homo sapiens (Human))
Washington University
Curated by ChEMBL
LigandPNGBDBM50104034(CHEMBL3593907)
Affinity DataKi:  718nM. Assay description: Displacement of Thio-T from human recombinant tau (243 to 375) expressed in Escherichia coli BL21(DE3)RIL after 1.5 hrs by fluorescence assay
In DepthDetails ArticlePubMed
TargetAmyloid-beta precursor protein(Homo sapiens (Human))
Washington University
Curated by ChEMBL
LigandPNGBDBM50104034(CHEMBL3593907)
Affinity DataKi:  741nM. Assay description: Displacement of Thio-T from amyloid beta (1 to 42) (unknown origin) expressed in Escherichia coli after 1.5 hrs by fluorescence assay
In DepthDetails ArticlePubMed