BDBM50104166 (2R,3S,4R,5R)-2-Aminomethyl-5-(6-amino-5-nitro-pyrimidin-4-ylamino)-tetrahydro-furan-3,4-diol::CHEMBL312260
SMILES NC[C@H]1O[C@@H](Nc2ncnc(N)c2[N+]([O-])=O)[C@H](O)[C@@H]1O
InChI Key InChIKey=ATDHOVSNWBQUML-UUOKFMHZSA-N
Data  1 IC50
  Tab Delimited (TSV)   2D SDfile   Computed 3D by Vconf -m prep SDfile
Find this compound or compounds like it in BindingDB:
Activity Spreadsheet -- Enzyme Inhibition Constant Data from BindingDB
Found 1 hit for monomerid = 50104166
TargetAdenosine kinase(Rattus norvegicus (rat))
Abbott Laboratories
Curated by ChEMBL
LigandPNGBDBM50104166((2R,3S,4R,5R)-2-Aminomethyl-5-(6-amino-5-nitro-pyr...)
Affinity DataIC50:  35nM. Assay description: In vitro inhibition of Adenosine kinase of rat brain cytosol.
In DepthDetails ArticlePubMed