BDBM50104874 3-(4-Hydroxy-phenyl)-7-isopropoxy-chromen-4-one::3-(4-Hydroxyphenyl)-7-isopropoxychromen-4-one::CHEMBL115109
SMILES CC(C)Oc1ccc2c(c1)occ(-c1ccc(O)cc1)c2=O
InChI Key InChIKey=DEQMUPGWSXUDKV-UHFFFAOYSA-N
Data  1 IC50
  Tab Delimited (TSV)   2D SDfile   Computed 3D by Vconf -m prep SDfile
Find this compound or compounds like it in BindingDB:
Activity Spreadsheet -- Enzyme Inhibition Constant Data from BindingDB
Found 1 hit for monomerid = 50104874
TargetAldehyde dehydrogenase, mitochondrial(Homo sapiens (Human))
Harvard Medical School
Curated by ChEMBL
LigandPNGBDBM50104874(3-(4-Hydroxy-phenyl)-7-isopropoxy-chromen-4-one | ...)
Affinity DataIC50:  80nM. Assay description: Inhibition of hamster liver aldehyde dehydrogenase ALDH-2
In DepthDetails ArticlePubMed