BDBM50105581 CHEMBL3597449
SMILES Cl.NC1CCc2cccc(-c3cccc(c3)C(N)=O)c2CC1=O
InChI Key InChIKey=YVNRNEBFNAZTIP-UHFFFAOYSA-N
Data  1 KI
  Tab Delimited (TSV)   2D SDfile   Computed 3D by Vconf -m prep SDfile
Find this compound or compounds like it in BindingDB:
Activity Spreadsheet -- Enzyme Inhibition Constant Data from BindingDB
Found 1 hit for monomerid = 50105581
TargetAminopeptidase N(Sus scrofa (Pig))
Universit£
Curated by ChEMBL
LigandPNGBDBM50105581(CHEMBL3597449)
Affinity DataKi:  10nM. Assay description: Inhibition of porcine kidney APN assessed as decrease in p-nitroanilide release using L-leucine-p-nitroanilide as substrate by spectrophotometric ana...
In DepthDetails ArticlePubMed