BDBM50106367 CHEMBL3596494
SMILES CC(C)N1CCC(COCc2cc(cc(c2)C(F)(F)F)-c2ccc(cc2)C#N)(CC1)c1ccccc1
InChI Key InChIKey=IMGUYNHHTVEEHW-UHFFFAOYSA-N
Data  1 IC50
  Tab Delimited (TSV)   2D SDfile   Computed 3D by Vconf -m prep SDfile
Find this compound or compounds like it in BindingDB:
Activity Spreadsheet -- Enzyme Inhibition Constant Data from BindingDB
Found 1 hit for monomerid = 50106367
TargetSubstance-P receptor(Rattus norvegicus (rat))
Bristol-Myers Squibb
Curated by ChEMBL
LigandPNGBDBM50106367(CHEMBL3596494)
Affinity DataIC50:  0.390nM. Assay description: Displacement of [125I]-substance P from gerbil NK1 receptor expressed in HEK293 cell membranes incubated for 30 mins by liquid scintillation counting...
In DepthDetails ArticlePubMed