BDBM50106892 3-[4-(3,4-dichlorophenyl)-3-[3,5-di(trifluoromethyl)phenyl(methyl)carboxamido]-(E,3R)-1-butenylcarboxamido]-2-oxo-(3R)-azepane::CHEMBL105060::N-[(E)-(R)-1-(3,4-Dichloro-benzyl)-3-((R)-2-oxo-azepan-3-ylcarbamoyl)-allyl]-N-methyl-3,5-bis-trifluoromethyl-benzamide::N-[(R,R)-(E)-(3,4-dichlorobenzyl)-3-(2-oxoazepan-3-yl)carbamoyl]allyl-N-methyl-3,5-bis(trifluoromethyl)benzamide
SMILES CN([C@H](Cc1ccc(Cl)c(Cl)c1)\C=C\C(=O)N[C@@H]1CCCCNC1=O)C(=O)c1cc(cc(c1)C(F)(F)F)C(F)(F)F
InChI Key InChIKey=BHCJHYIMNHXLOM-WVDRJWPYSA-N
Data  2 IC50
  Tab Delimited (TSV)   2D SDfile   Computed 3D by Vconf -m prep SDfile
Find this compound or compounds like it in BindingDB:
Activity Spreadsheet -- Enzyme Inhibition Constant Data from BindingDB
Found 2 hits for monomerid = 50106892
TargetSubstance-K receptor(Homo sapiens (Human))
Novartis Pharma
Curated by ChEMBL
LigandPNGBDBM50106892(3-[4-(3,4-dichlorophenyl)-3-[3,5-di(trifluoromethy...)
Affinity DataIC50:  5.5nM. Assay description: In vitro binding affinity for Tachykinin receptor 2 of human-CHO cells using 125 I-NKA radioligand
In DepthDetails ArticlePubMed
TargetSubstance-P receptor(Homo sapiens (Human))
Novartis Pharma
Curated by ChEMBL
LigandPNGBDBM50106892(3-[4-(3,4-dichlorophenyl)-3-[3,5-di(trifluoromethy...)
Affinity DataIC50:  4.80nM. Assay description: In vitro binding affinity for Tachykinin receptor 1 of bovine retinal membranes using [3H]-Sar9-substance P as radioligand
In DepthDetails ArticlePubMed