BDBM50107250 CHEMBL136563::[3-(5-Methoxy-3,4-dihydro-2H-naphthalen-1-ylidene)-propyl]-[2-(pyridin-2-yloxy)-ethyl]-amine
SMILES COc1cccc2\C(CCCc12)=C\CCNCCOc1ccccn1
InChI Key InChIKey=YFOSHVNQFAEBLL-CAOOACKPSA-N
Data  2 KI
  Tab Delimited (TSV)   2D SDfile   Computed 3D by Vconf -m prep SDfile
Find this compound or compounds like it in BindingDB:
Activity Spreadsheet -- Enzyme Inhibition Constant Data from BindingDB
Found 2 hits for monomerid = 50107250
Target5-hydroxytryptamine receptor 1A(Rattus norvegicus (rat))
Università
Curated by ChEMBL
LigandPNGBDBM50107250(CHEMBL136563 | [3-(5-Methoxy-3,4-dihydro-2H-naphth...)
Affinity DataKi:  0.710nM. Assay description: Binding was determined on 5-hydroxytryptamine 1A receptor in rat hippocampal membranes
In DepthDetails ArticlePubMed
TargetD(2) dopamine receptor(Rattus norvegicus (rat))
Università
Curated by ChEMBL
LigandPNGBDBM50107250(CHEMBL136563 | [3-(5-Methoxy-3,4-dihydro-2H-naphth...)
Affinity DataKi: >850nM. Assay description: Binding affinity towards dopamine receptor D2 in rat striatal membranes
In DepthDetails ArticlePubMed