BDBM50108075 4'-{[3-(4-Nitro-benzyl)-3H-imidazol-4-ylmethyl]-amino}-[1,1';2',1'']terphenyl-3-carboxylic acid methyl ester 27(FTI-2307)::CHEMBL299245
SMILES COC(=O)c1cccc(c1)-c1ccc(NCc2cncn2Cc2ccc(cc2)[N+]([O-])=O)cc1-c1ccccc1
InChI Key InChIKey=UFMVMYNPAOPEML-UHFFFAOYSA-N
Data  2 IC50
  Tab Delimited (TSV)   2D SDfile   Computed 3D by Vconf -m prep SDfile
Find this compound or compounds like it in BindingDB:
Activity Spreadsheet -- Enzyme Inhibition Constant Data from BindingDB
Found 2 hits for monomerid = 50108075
LigandPNGBDBM50108075(4'-{[3-(4-Nitro-benzyl)-3H-imidazol-4-ylmethyl]-am...)
Affinity DataIC50:  5.90E+3nM. Assay description: Inhibition of partially purified Geranylgeranyl transferase type I (GGTase-I) from human Burkitt lymphoma (Daudi) cells
In DepthDetails ArticlePubMed
TargetDimer of Protein farnesyltransferase subunit beta(Homo sapiens (Human))
Yale University
Curated by ChEMBL
LigandPNGBDBM50108075(4'-{[3-(4-Nitro-benzyl)-3H-imidazol-4-ylmethyl]-am...)
Affinity DataIC50:  310nM. Assay description: Inhibition of farnesyltransferase from human Burkitt lymphoma (Daudi) cells
In DepthDetails ArticlePubMed