BDBM50108500 2-Methyl-furan-3-carboxylic acid [4-(methyl-{4-methyl-2-[6-(4-methyl-piperazin-1-yl)-6-oxo-hexyloxy]-phenyl}-carbamoyl)-phenyl]-amide::CHEMBL74593
SMILES CN(C(=O)c1ccc(NC(=O)c2ccoc2C)cc1)c1ccc(C)cc1OCCCCCC(=O)N1CCN(C)CC1
InChI Key InChIKey=HLSBJGNMECMRGP-UHFFFAOYSA-N
Data  2 KI
  Tab Delimited (TSV)   2D SDfile   Computed 3D by Vconf -m prep SDfile
Find this compound or compounds like it in BindingDB:
Activity Spreadsheet -- Enzyme Inhibition Constant Data from BindingDB
Found 2 hits for monomerid = 50108500
TargetVasopressin V1a receptor(RAT)
Yamanouchi Pharmaceutical
Curated by ChEMBL
LigandPNGBDBM50108500(2-Methyl-furan-3-carboxylic acid [4-(methyl-{4-met...)
Affinity DataKi:  8.80nM. Assay description: Evaluated for the binding affinity towards vasopressin (V1A) receptor in rat liver membrane using [3H]AVP as radioligand
In DepthDetails ArticlePubMed
TargetVasopressin V2 receptor(Rattus norvegicus (Rat))
Yamanouchi Pharmaceutical
Curated by ChEMBL
LigandPNGBDBM50108500(2-Methyl-furan-3-carboxylic acid [4-(methyl-{4-met...)
Affinity DataKi:  73nM. Assay description: Evaluated for the binding affinity towards vasopressin (V2) receptor in rat kidney membrane using [3H]AVP as radioligand
In DepthDetails ArticlePubMed