BDBM50108912 CHEMBL162782::{Hydroxy-[2-(4-hydroxy-6-methoxy-7-methyl-3-oxo-1,3-dihydro-isobenzofuran-5-yl)-ethoxy]-phosphorylmethyl}-phosphonic acid(bis(phosphonate)
SMILES COc1c(C)c2COC(=O)c2c(O)c1CCOP(O)(=O)CP(O)(O)=O
InChI Key InChIKey=KBARFQMSXJWAKG-UHFFFAOYSA-N
Data  2 KI
  Tab Delimited (TSV)   2D SDfile   Computed 3D by Vconf -m prep SDfile
Find this compound or compounds like it in BindingDB:
Activity Spreadsheet -- Enzyme Inhibition Constant Data from BindingDB
Found 2 hits for monomerid = 50108912
TargetInosine-5'-monophosphate dehydrogenase 2(Homo sapiens (Human))
Pharmasset
Curated by ChEMBL
LigandPNGBDBM50108912(CHEMBL162782 | {Hydroxy-[2-(4-hydroxy-6-methoxy-7-...)
Affinity DataKi:  400nM. Assay description: Inhibitory activity against human Inosine-5'-monophosphate dehydrogenase 2 (IMPDH type II)
In DepthDetails ArticlePubMed
TargetInosine-5'-monophosphate dehydrogenase 1(Homo sapiens (Human))
Pharmasset
Curated by ChEMBL
LigandPNGBDBM50108912(CHEMBL162782 | {Hydroxy-[2-(4-hydroxy-6-methoxy-7-...)
Affinity DataKi:  890nM. Assay description: Inhibitory activity against human Inosine-5'-monophosphate dehydrogenase 1 (IMPDH type I)
In DepthDetails ArticlePubMed